Quantcast

Camel - Commits

This forum is an archive for the mailing list commits@camel.apache.org (more options) Messages posted here will be sent to this mailing list.
1 ... 1265126612671268126912701271 ... 1286
Topics (45006)
Replies Last Post Views Sub Forum
svn commit: r573201 - in /activemq/camel/trunk: camel-core/src/main/java/org/apache/camel/impl/ camel-core/src/main/java/org/apache/camel/util/ components/camel-spring/src/main/java/org/apache/camel/spring/ by jstrachan-2
0
by jstrachan-2
Camel - Commits (activemq)
[Bamboo] Camel - Default build 244 has FAILED (0 tests failed). Change made by James Strachan by Bamboo-3
0
by Bamboo-3
Camel - Commits (activemq)
[Bamboo] Camel - Default build 243 has FAILED (0 tests failed). Change made by James Strachan by Bamboo-3
0
by Bamboo-3
Camel - Commits (activemq)
svn commit: r573195 - /activemq/camel/trunk/camel-core/src/main/java/org/apache/camel/component/bean/BeanComponent.java by jstrachan-2
0
by jstrachan-2
Camel - Commits (activemq)
svn commit: r573193 - /activemq/camel/trunk/camel-core/src/main/java/org/apache/camel/component/timer/TimerEndpoint.java by jstrachan-2
0
by jstrachan-2
Camel - Commits (activemq)
[Bamboo] Camel - Default build 242 has FAILED (0 tests failed). Change made by James Strachan by Bamboo-3
0
by Bamboo-3
Camel - Commits (activemq)
svn commit: r573180 - /activemq/camel/trunk/camel-core/src/main/java/org/apache/camel/builder/BuilderSupport.java by jstrachan-2
0
by jstrachan-2
Camel - Commits (activemq)
[Bamboo] Camel - Default build 241 has FAILED (0 tests failed). Change made by Hiram Chirino by Bamboo-3
0
by Bamboo-3
Camel - Commits (activemq)
svn commit: r572995 - /activemq/camel/trunk/pom.xml by chirino
0
by chirino
Camel - Commits (activemq)
[Bamboo] Camel - Default build 240 has FAILED (0 tests failed). Change made by James Strachan by Bamboo-3
0
by Bamboo-3
Camel - Commits (activemq)
svn commit: r572899 - in /activemq/camel/trunk: camel-core/src/main/java/org/apache/camel/component/bean/ camel-core/src/main/java/org/apache/camel/component/direct/ camel-core/src/main/java/org/apache/camel/component/file/ camel-core/src/main/java/org... by jstrachan-2
0
by jstrachan-2
Camel - Commits (activemq)
[Bamboo] Camel - Default build 239 has FAILED (0 tests failed). Change made by Hiram Chirino by Bamboo-3
0
by Bamboo-3
Camel - Commits (activemq)
svn commit: r572785 - in /activemq/camel/trunk/camel-core/src: main/java/org/apache/camel/processor/Pipeline.java test/java/org/apache/camel/processor/PipelineTest.java by chirino
0
by chirino
Camel - Commits (activemq)
[Bamboo] Camel - Default build 439 was SUCCESSFUL (with 331 tests). Change made by James Strachan by Bamboo-3
0
by Bamboo-3
Camel - Commits (activemq)
[Bamboo] Camel - Default build 238 has FAILED (0 tests failed). Change made by James Strachan by Bamboo-3
0
by Bamboo-3
Camel - Commits (activemq)
svn commit: r572752 - in /activemq/camel/trunk: camel-core/src/main/java/org/apache/camel/ camel-core/src/main/java/org/apache/camel/impl/ camel-core/src/main/java/org/apache/camel/processor/ camel-core/src/main/java/org/apache/camel/util/ camel-core/s... by jstrachan-2
0
by jstrachan-2
Camel - Commits (activemq)
[Bamboo] Camel - Default build 438 has FAILED (3 tests failed, no failures were new). Change made by James Strachan by Bamboo-3
0
by Bamboo-3
Camel - Commits (activemq)
[Bamboo] Camel - Default build 237 has FAILED (0 tests failed). Change made by James Strachan by Bamboo-3
0
by Bamboo-3
Camel - Commits (activemq)
svn commit: r572720 - in /activemq/camel/trunk/camel-core/src: main/java/org/apache/camel/model/ChoiceType.java test/java/org/apache/camel/processor/FaultRouteTest.java by jstrachan-2
0
by jstrachan-2
Camel - Commits (activemq)
[Bamboo] Camel - Default build 437 has FAILED (3 tests failed, 2 failures were new). Change made by Guillaume Nodet and James Strachan by Bamboo-3
0
by Bamboo-3
Camel - Commits (activemq)
[Bamboo] Camel - Default build 236 has FAILED (0 tests failed). Change made by Guillaume Nodet and James Strachan by Bamboo-3
0
by Bamboo-3
Camel - Commits (activemq)
svn commit: r572712 - in /activemq/camel/trunk/camel-core/src: main/java/org/apache/camel/ main/java/org/apache/camel/impl/ main/java/org/apache/camel/util/ test/java/org/apache/camel/impl/ by jstrachan-2
0
by jstrachan-2
Camel - Commits (activemq)
svn commit: r572709 - in /activemq/camel/trunk/camel-core/src/main/java/org/apache/camel: Exchange.java ExchangePattern.java component/mock/MockEndpoint.java impl/DefaultExchange.java by Guillaume Nodet-2
0
by Guillaume Nodet-2
Camel - Commits (activemq)
[Bamboo] Camel - Default build 436 has FAILED (1 tests failed). Change made by James Strachan by Bamboo-3
0
by Bamboo-3
Camel - Commits (activemq)
[Bamboo] Camel - Default build 235 has FAILED (0 tests failed). Change made by James Strachan by Bamboo-3
0
by Bamboo-3
Camel - Commits (activemq)
svn commit: r572625 - in /activemq/camel/trunk: camel-core/src/main/java/org/apache/camel/ camel-core/src/main/java/org/apache/camel/component/bean/ camel-core/src/main/java/org/apache/camel/component/direct/ camel-core/src/main/java/org/apache/camel/c... by jstrachan-2
0
by jstrachan-2
Camel - Commits (activemq)
[Bamboo] Camel - Default build 234 has FAILED (0 tests failed). Change made by James Strachan by Bamboo-3
0
by Bamboo-3
Camel - Commits (activemq)
[Bamboo] Camel - Default build 233 has FAILED (0 tests failed). Change made by James Strachan by Bamboo-3
0
by Bamboo-3
Camel - Commits (activemq)
svn commit: r572608 - in /activemq/camel/trunk/camel-core/src/main/java/org/apache/camel: Exchange.java impl/DefaultExchange.java by jstrachan-2
0
by jstrachan-2
Camel - Commits (activemq)
svn commit: r572607 - in /activemq/camel/trunk: ./ apache-camel/ apache-camel/src/main/descriptors/ camel-core/src/main/java/org/apache/camel/ camel-core/src/main/java/org/apache/camel/component/file/ camel-core/src/main/java/org/apache/camel/component... by jstrachan-2
0
by jstrachan-2
Camel - Commits (activemq)
[Bamboo] Camel - Default build 232 has FAILED (0 tests failed). Change made by James Strachan by Bamboo-3
0
by Bamboo-3
Camel - Commits (activemq)
svn commit: r572600 - in /activemq/camel/trunk: camel-core/src/main/java/org/apache/camel/impl/ camel-core/src/main/java/org/apache/camel/impl/converter/ tests/camel-partial-classpath-test/src/test/resources/ by jstrachan-2
0
by jstrachan-2
Camel - Commits (activemq)
[Bamboo] Camel - Default build 231 has FAILED (0 tests failed). Change made by James Strachan by Bamboo-3
0
by Bamboo-3
Camel - Commits (activemq)
svn commit: r572579 - in /activemq/camel/trunk/tests/camel-partial-classpath-test/src/test: java/org/apache/camel/tests/partialclasspath/ resources/META-INF/ resources/META-INF/services/ resources/META-INF/services/org/ resources/META-INF/services/org/... by jstrachan-2
0
by jstrachan-2
Camel - Commits (activemq)
[Bamboo] Camel - Default build 230 has FAILED (0 tests failed). Change made by James Strachan by Bamboo-3
0
by Bamboo-3
Camel - Commits (activemq)
1 ... 1265126612671268126912701271 ... 1286