Camel - Commits

This forum is an archive for the mailing list commits@camel.apache.org (more options) Messages posted here will be sent to this mailing list.
1 ... 1422142314241425142614271428 ... 1454
Topics (50871)
Replies Last Post Views Sub Forum
[Bamboo] Camel - Default build 376 has FAILED (0 tests failed). Change made by James Strachan by Bamboo-3
0
by Bamboo-3
Camel - Commits (activemq)
svn commit: r584250 - in /activemq/camel/trunk/components/camel-saxon/src: main/java/org/apache/camel/builder/saxon/ main/resources/META-INF/services/org/apache/camel/language/ test/java/org/apache/camel/builder/saxon/ by jstrachan-2
0
by jstrachan-2
Camel - Commits (activemq)
[Bamboo] Camel - Default build 375 has FAILED (0 tests failed). Change made by James Strachan by Bamboo-3
0
by Bamboo-3
Camel - Commits (activemq)
svn commit: r584245 - in /activemq/camel/trunk/camel-core/src/main/java/org/apache/camel: InvalidPayloadRuntimeException.java builder/xml/XPathBuilder.java model/language/XQueryExpression.java by jstrachan-2
0
by jstrachan-2
Camel - Commits (activemq)
[Bamboo] Camel - Default build 581 was SUCCESSFUL (with 408 tests). Change made by James Strachan by Bamboo-3
0
by Bamboo-3
Camel - Commits (activemq)
[Bamboo] Camel - Default build 374 has FAILED (0 tests failed). Change made by James Strachan by Bamboo-3
0
by Bamboo-3
Camel - Commits (activemq)
svn commit: r584181 - /activemq/camel/trunk/camel-core/src/main/java/org/apache/camel/util/ObjectHelper.java by jstrachan-2
0
by jstrachan-2
Camel - Commits (activemq)
[Bamboo] Camel - Default build 580 has FAILED (1 tests failed, no failures were new). Change made by James Strachan by Bamboo-3
0
by Bamboo-3
Camel - Commits (activemq)
[Bamboo] Camel - Default build 373 has FAILED (0 tests failed). Change made by James Strachan by Bamboo-3
0
by Bamboo-3
Camel - Commits (activemq)
svn commit: r584168 - /activemq/camel/trunk/components/camel-spring/src/test/java/org/apache/camel/spring/processor/SpringFilterTest.java by jstrachan-2
0
by jstrachan-2
Camel - Commits (activemq)
[Bamboo] Camel - Default build 579 has FAILED (1 tests failed, no failures were new). Change made by James Strachan by Bamboo-3
0
by Bamboo-3
Camel - Commits (activemq)
[Bamboo] Camel - Default build 372 has FAILED (0 tests failed). Change made by James Strachan by Bamboo-3
0
by Bamboo-3
Camel - Commits (activemq)
svn commit: r584122 - in /activemq/camel/trunk: camel-core/src/main/java/org/apache/camel/model/ camel-core/src/main/java/org/apache/camel/model/dataformat/ components/camel-jaxb/src/test/java/org/apache/camel/example/ components/camel-jaxb/src/test/re... by jstrachan-2
0
by jstrachan-2
Camel - Commits (activemq)
[Bamboo] Camel - Default build 578 has FAILED (1 tests failed, no failures were new). Change made by James Strachan by Bamboo-3
0
by Bamboo-3
Camel - Commits (activemq)
[Bamboo] Camel - Default build 371 has FAILED (0 tests failed). Change made by James Strachan by Bamboo-3
0
by Bamboo-3
Camel - Commits (activemq)
svn commit: r584112 - in /activemq/camel/trunk: camel-core/src/main/java/org/apache/camel/builder/xml/ camel-core/src/main/java/org/apache/camel/model/language/ camel-core/src/main/java/org/apache/camel/spi/ camel-core/src/test/java/org/apache/camel/bu... by jstrachan-2
0
by jstrachan-2
Camel - Commits (activemq)
[Bamboo] Camel - Default build 577 has FAILED (1 tests failed). Change made by James Strachan by Bamboo-3
0
by Bamboo-3
Camel - Commits (activemq)
[Bamboo] Camel - Default build 370 has FAILED (0 tests failed). Change made by James Strachan by Bamboo-3
0
by Bamboo-3
Camel - Commits (activemq)
svn commit: r584100 - in /activemq/camel/trunk: camel-core/src/main/java/org/apache/camel/model/language/ camel-core/src/test/java/org/apache/camel/processor/ components/camel-spring/src/main/java/org/apache/camel/spring/handler/ by jstrachan-2
0
by jstrachan-2
Camel - Commits (activemq)
[Bamboo] Camel - NightlyDeploy build 177 has FAILED. Change made by James Strachan by Bamboo-3
0
by Bamboo-3
Camel - Commits (activemq)
[Bamboo] Camel - Default build 576 was SUCCESSFUL (with 405 tests). Change made by James Strachan by Bamboo-3
0
by Bamboo-3
Camel - Commits (activemq)
[Bamboo] Camel - Default build 369 has FAILED (0 tests failed). Change made by James Strachan by Bamboo-3
0
by Bamboo-3
Camel - Commits (activemq)
[Bamboo] Camel - Default build 575 has FAILED (1 tests failed). Change made by James Strachan by Bamboo-3
0
by Bamboo-3
Camel - Commits (activemq)
svn commit: r583924 - in /activemq/camel/trunk/components/camel-jms/src/test/java/org/apache/camel/component/jms/issues: ./ JmsIssue170Test.java by jstrachan-2
0
by jstrachan-2
Camel - Commits (activemq)
[Bamboo] Camel - Default build 368 has FAILED (0 tests failed). Change made by James Strachan by Bamboo-3
0
by Bamboo-3
Camel - Commits (activemq)
svn commit: r583920 - /activemq/camel/trunk/camel-core/src/test/java/org/apache/camel/issues/Issue170Test.java by jstrachan-2
0
by jstrachan-2
Camel - Commits (activemq)
[Bamboo] Camel - Default build 367 has FAILED (0 tests failed). Change made by James Strachan by Bamboo-3
0
by Bamboo-3
Camel - Commits (activemq)
svn commit: r583907 - in /activemq/camel/trunk: camel-core/src/main/java/org/apache/camel/model/ camel-core/src/main/java/org/apache/camel/model/dataformat/ components/camel-jaxb/src/test/java/org/apache/camel/example/ components/camel-jaxb/src/test/re... by jstrachan-2
0
by jstrachan-2
Camel - Commits (activemq)
[Bamboo] Camel - Default build 366 has FAILED (0 tests failed). Change made by James Strachan by Bamboo-3
0
by Bamboo-3
Camel - Commits (activemq)
svn commit: r583844 - in /activemq/camel/trunk: camel-core/src/main/java/org/apache/camel/model/dataformat/ components/camel-jaxb/src/main/java/org/apache/camel/converter/jaxb/ components/camel-jaxb/src/test/java/org/apache/camel/example/ components/ca... by jstrachan-2
0
by jstrachan-2
Camel - Commits (activemq)
[Bamboo] Camel - Default build 365 has FAILED (0 tests failed). Change made by James Strachan by Bamboo-3
0
by Bamboo-3
Camel - Commits (activemq)
svn commit: r583819 - in /activemq/camel/trunk: camel-core/src/main/java/org/apache/camel/builder/ camel-core/src/main/java/org/apache/camel/component/mock/ camel-core/src/main/java/org/apache/camel/impl/ camel-core/src/main/java/org/apache/camel/impl/... by jstrachan-2
0
by jstrachan-2
Camel - Commits (activemq)
[Bamboo] Camel - Default build 364 has FAILED (0 tests failed). Change made by James Strachan by Bamboo-3
0
by Bamboo-3
Camel - Commits (activemq)
svn commit: r583809 - /activemq/camel/trunk/components/camel-jms/src/test/java/org/apache/camel/component/jms/discovery/JmsDiscoveryTest.java by jstrachan-2
0
by jstrachan-2
Camel - Commits (activemq)
[Bamboo] Camel - Default build 363 has FAILED (0 tests failed). Change made by James Strachan by Bamboo-3
0
by Bamboo-3
Camel - Commits (activemq)
1 ... 1422142314241425142614271428 ... 1454