[VOTE] Release Apache Camel 2.13.1

classic Classic list List threaded Threaded
17 messages Options
Reply | Threaded
Open this post in threaded view
|

[VOTE] Release Apache Camel 2.13.1

Willem.Jiang
Administrator

This is a vote to release Apache Camel 2.13.1, a patch release coming  
with about 72 issues fixed.  

Release notes:  
https://issues.apache.org/jira/secure/ReleaseNote.jspa?version=12326053&styleName=&projectId=12311211 

Staging repo:  
https://repository.apache.org/content/repositories/orgapachecamel-1008  

Tarballs:  
https://repository.apache.org/content/repositories/orgapachecamel-1008/org/apache/camel/apache-camel/2.13.1/  

Tag:  
https://git-wip-us.apache.org/repos/asf?p=camel.git;a=tag;h=40a6d95594324b1e7d7f24f92d4f4822ab2f83d0 

Please test this release candidate and cast your vote.  
[ ] +1 Release the binary as Apache Camel 2.13.1  
[ ] -1 Veto the release (provide specific comments)  
Vote is open for at least 72 hours.  


--  
Willem Jiang

Red Hat, Inc.
Web: http://www.redhat.com
Blog: http://willemjiang.blogspot.com (English)
http://jnn.iteye.com (Chinese)
Twitter: willemjiang  
Weibo: 姜宁willem



Reply | Threaded
Open this post in threaded view
|

Re: [VOTE] Release Apache Camel 2.13.1

Willem.Jiang
Administrator
I just ran the unit tests with Camel in Action code (by upgrading the CXF version to 2.7.11 and Camel version to 2.13.1), all tests were passed.

Here is my +1 for this vote.

--  
Willem Jiang

Red Hat, Inc.
Web: http://www.redhat.com
Blog: http://willemjiang.blogspot.com (English)
http://jnn.iteye.com (Chinese)
Twitter: willemjiang  
Weibo: 姜宁willem



On May 8, 2014 at 9:48:14 AM, Willem Jiang ([hidden email]) wrote:

>  
> This is a vote to release Apache Camel 2.13.1, a patch release coming
> with about 72 issues fixed.
>  
> Release notes:
> https://issues.apache.org/jira/secure/ReleaseNote.jspa?version=12326053&styleName=&projectId=12311211 
>  
> Staging repo:
> https://repository.apache.org/content/repositories/orgapachecamel-1008
>  
> Tarballs:
> https://repository.apache.org/content/repositories/orgapachecamel-1008/org/apache/camel/apache-camel/2.13.1/ 
>  
> Tag:
> https://git-wip-us.apache.org/repos/asf?p=camel.git;a=tag;h=40a6d95594324b1e7d7f24f92d4f4822ab2f83d0 
>  
> Please test this release candidate and cast your vote.
> [ ] +1 Release the binary as Apache Camel 2.13.1
> [ ] -1 Veto the release (provide specific comments)
> Vote is open for at least 72 hours.
>  
>  
> --
> Willem Jiang
>  
> Red Hat, Inc.
> Web: http://www.redhat.com
> Blog: http://willemjiang.blogspot.com (English)
> http://jnn.iteye.com (Chinese)
> Twitter: willemjiang
> Weibo: 姜宁willem
>  
>  
>  
>  

Reply | Threaded
Open this post in threaded view
|

Re: [VOTE] Release Apache Camel 2.13.1

Claus Ibsen-2
In reply to this post by Willem.Jiang
Hi

The here been some mailing problems at ASF. But it seems the mails
start to flow in again at a steady pace.

I have been testing this 2.13.1 RC for a bit and it looks good from my
point of view.

+1

I did notice that the JARs contains duplicate of
LICENSE
LICENSE.txt
NOTICE
NOTICE.txt

But they have always done that. But maybe we should try to get that
fixed so there is only 1 file of each?



On Thu, May 8, 2014 at 3:48 AM, Willem Jiang <[hidden email]> wrote:

>
> This is a vote to release Apache Camel 2.13.1, a patch release coming
> with about 72 issues fixed.
>
> Release notes:
> https://issues.apache.org/jira/secure/ReleaseNote.jspa?version=12326053&styleName=&projectId=12311211
>
> Staging repo:
> https://repository.apache.org/content/repositories/orgapachecamel-1008
>
> Tarballs:
> https://repository.apache.org/content/repositories/orgapachecamel-1008/org/apache/camel/apache-camel/2.13.1/
>
> Tag:
> https://git-wip-us.apache.org/repos/asf?p=camel.git;a=tag;h=40a6d95594324b1e7d7f24f92d4f4822ab2f83d0
>
> Please test this release candidate and cast your vote.
> [ ] +1 Release the binary as Apache Camel 2.13.1
> [ ] -1 Veto the release (provide specific comments)
> Vote is open for at least 72 hours.
>
>
> --
> Willem Jiang
>
> Red Hat, Inc.
> Web: http://www.redhat.com
> Blog: http://willemjiang.blogspot.com (English)
> http://jnn.iteye.com (Chinese)
> Twitter: willemjiang
> Weibo: 姜宁willem
>
>
>



--
Claus Ibsen
-----------------
Red Hat, Inc.
Email: [hidden email]
Twitter: davsclaus
Blog: http://davsclaus.com
Author of Camel in Action: http://www.manning.com/ibsen
hawtio: http://hawt.io/
fabric8: http://fabric8.io/
Reply | Threaded
Open this post in threaded view
|

Re: [VOTE] Release Apache Camel 2.13.1

Peter Keller
In reply to this post by Willem.Jiang
-1

I use MacOS with java version "1.7.0_40".

I downloaded http://repository.apache.org/content/repositories/orgapachecamel-1008/org/apache/camel/apache-camel/2.13.1/apache-camel-2.13.1-src.zip, executed "mvn install" and got following error:

Running org.apache.camel.view.XmlGraphTest
Tests run: 1, Failures: 0, Errors: 0, Skipped: 0, Time elapsed: 0.092 sec - in org.apache.camel.view.XmlGraphTest

Results :

Failed tests:
  FileProducerRenameUsingCopyTest>TestSupport.runBare:58->testMove:41->ContextTestSupport.assertMockEndpointsSatisfied:343 mock://result Content of file: target/file/done/hello.txt. Expected: <Hello Camel> but was: <>

Tests run: 4902, Failures: 1, Errors: 0, Skipped: 3

I re-exucuted "mvn install" and got several errors of following type:

Tests run: 3, Failures: 0, Errors: 0, Skipped: 0, Time elapsed: 0.077 sec - in org.apache.camel.management.JmxInstrumentationUsingPropertiesTest
Running org.apache.camel.management.JmxInstrumentationWithConnectorTest
Tests run: 3, Failures: 0, Errors: 1, Skipped: 0, Time elapsed: 942.325 sec <<< FAILURE! - in org.apache.camel.management.JmxInstrumentationWithConnectorTest
testCounters(org.apache.camel.management.JmxInstrumentationWithConnectorTest)  Time elapsed: 7.609 sec  <<< ERROR!
java.io.IOException: Failed to retrieve RMIServer stub: javax.naming.NameNotFoundException: jmxrmi/camel
        at com.sun.jndi.rmi.registry.RegistryContext.lookup(RegistryContext.java:116)
        at com.sun.jndi.toolkit.url.GenericURLContext.lookup(GenericURLContext.java:203)
        at javax.naming.InitialContext.lookup(InitialContext.java:411)
        at javax.management.remote.rmi.RMIConnector.findRMIServerJNDI(RMIConnector.java:1925)
        at javax.management.remote.rmi.RMIConnector.findRMIServer(RMIConnector.java:1892)
        at javax.management.remote.rmi.RMIConnector.connect(RMIConnector.java:275)
        at javax.management.remote.JMXConnectorFactory.connect(JMXConnectorFactory.java:268)
        at org.apache.camel.management.JmxInstrumentationWithConnectorTest.getMBeanConnection(JmxInstrumentationWithConnectorTest.java:100)



Reply | Threaded
Open this post in threaded view
|

Re: [VOTE] Release Apache Camel 2.13.1

Willem.Jiang
Administrator
Hi Peter,

Can you use "mvn clean install" to start the build again?
I ran the tests before I cut the camel 2.13.1.


--  
Willem Jiang

Red Hat, Inc.
Web: http://www.redhat.com
Blog: http://willemjiang.blogspot.com (English)
http://jnn.iteye.com (Chinese)
Twitter: willemjiang  
Weibo: 姜宁willem



On May 11, 2014 at 9:46:27 PM, Peter Keller ([hidden email]) wrote:

> -1
>  
> I use MacOS with java version "1.7.0_40".
>  
> I downloaded
> http://repository.apache.org/content/repositories/orgapachecamel-1008/org/apache/camel/apache-camel/2.13.1/apache-camel-2.13.1-src.zip,  
> executed "mvn install" and got following error:
>  
> Running org.apache.camel.view.XmlGraphTest
> Tests run: 1, Failures: 0, Errors: 0, Skipped: 0, Time elapsed: 0.092 sec -
> in org.apache.camel.view.XmlGraphTest
>  
> Results :
>  
> Failed tests:
>  
> FileProducerRenameUsingCopyTest>TestSupport.runBare:58->testMove:41->ContextTestSupport.assertMockEndpointsSatisfied:343  
> mock://result Content of file: target/file/done/hello.txt. Expected: > Camel> but was: <>
>  
> Tests run: 4902, Failures: 1, Errors: 0, Skipped: 3
>  
> I re-exucuted "mvn install" and got several errors of following type:
>  
> Tests run: 3, Failures: 0, Errors: 0, Skipped: 0, Time elapsed: 0.077 sec -
> in org.apache.camel.management.JmxInstrumentationUsingPropertiesTest
> Running org.apache.camel.management.JmxInstrumentationWithConnectorTest
> Tests run: 3, Failures: 0, Errors: 1, Skipped: 0, Time elapsed: 942.325 sec
> <<< FAILURE! - in
> org.apache.camel.management.JmxInstrumentationWithConnectorTest
> testCounters(org.apache.camel.management.JmxInstrumentationWithConnectorTest)  
> Time elapsed: 7.609 sec <<< ERROR!
> java.io.IOException: Failed to retrieve RMIServer stub:
> javax.naming.NameNotFoundException: jmxrmi/camel
> at
> com.sun.jndi.rmi.registry.RegistryContext.lookup(RegistryContext.java:116)  
> at
> com.sun.jndi.toolkit.url.GenericURLContext.lookup(GenericURLContext.java:203)  
> at javax.naming.InitialContext.lookup(InitialContext.java:411)
> at
> javax.management.remote.rmi.RMIConnector.findRMIServerJNDI(RMIConnector.java:1925)  
> at
> javax.management.remote.rmi.RMIConnector.findRMIServer(RMIConnector.java:1892)  
> at javax.management.remote.rmi.RMIConnector.connect(RMIConnector.java:275)  
> at
> javax.management.remote.JMXConnectorFactory.connect(JMXConnectorFactory.java:268)  
> at
> org.apache.camel.management.JmxInstrumentationWithConnectorTest.getMBeanConnection(JmxInstrumentationWithConnectorTest.java:100)  
>  
>  
>  
>  
>  
>  
>  
> --
> View this message in context: http://camel.465427.n5.nabble.com/VOTE-Release-Apache-Camel-2-13-1-tp5750981p5750990.html 
> Sent from the Camel Development mailing list archive at Nabble.com.
>  

Reply | Threaded
Open this post in threaded view
|

Re: [VOTE] Release Apache Camel 2.13.1

Peter Keller
With "mvn clean install", I got following error when running the tests for the  Camel :: JAXB  module:

Failed tests:
  JaxbDataFormatSchemaValidationSpringTest.testMarshallWithValidationException:79->Assert.assertTrue:52->Assert.assertTrue:41->Assert.fail:86 null
JaxbDataFormatSchemaValidationSpringTest.testUnmarshallWithValidationException:122->Assert.assertTrue:52->Assert.assertTrue:41->Assert.fail:86 null  JaxbDataFormatSchemaValidationTest.testMarshallWithValidationException:78->Assert.assertTrue:52->Assert.assertTrue:41->Assert.fail:86 null
JaxbDataFormatSchemaValidationTest.testUnmarshallWithValidationException:121->Assert.assertTrue:52->Assert.assertTrue:41->Assert.fail:86 null

Tests run: 90, Failures: 4, Errors: 0, Skipped: 0



On Sun, May 11, 2014 at 7:05 PM, Willem.Jiang [via Camel] <[hidden email]> wrote:
Hi Peter,

Can you use "mvn clean install" to start the build again?
I ran the tests before I cut the camel 2.13.1.


--  
Willem Jiang

Red Hat, Inc.
Web: http://www.redhat.com
Blog: http://willemjiang.blogspot.com (English)
http://jnn.iteye.com (Chinese)
Twitter: willemjiang  
Weibo: 姜宁willem



On May 11, 2014 at 9:46:27 PM, Peter Keller ([hidden email]) wrote:

> -1
>  
> I use MacOS with java version "1.7.0_40".
>  
> I downloaded
> http://repository.apache.org/content/repositories/orgapachecamel-1008/org/apache/camel/apache-camel/2.13.1/apache-camel-2.13.1-src.zip,  
> executed "mvn install" and got following error:
>  
> Running org.apache.camel.view.XmlGraphTest
> Tests run: 1, Failures: 0, Errors: 0, Skipped: 0, Time elapsed: 0.092 sec -
> in org.apache.camel.view.XmlGraphTest
>  
> Results :
>  
> Failed tests:
>  
> FileProducerRenameUsingCopyTest>TestSupport.runBare:58->testMove:41->ContextTestSupport.assertMockEndpointsSatisfied:343  
> mock://result Content of file: target/file/done/hello.txt. Expected: > Camel> but was: <>
>  

> Tests run: 4902, Failures: 1, Errors: 0, Skipped: 3
>  
> I re-exucuted "mvn install" and got several errors of following type:
>  
> Tests run: 3, Failures: 0, Errors: 0, Skipped: 0, Time elapsed: 0.077 sec -
> in org.apache.camel.management.JmxInstrumentationUsingPropertiesTest
> Running org.apache.camel.management.JmxInstrumentationWithConnectorTest
> Tests run: 3, Failures: 0, Errors: 1, Skipped: 0, Time elapsed: 942.325 sec
> <<< FAILURE! - in
> org.apache.camel.management.JmxInstrumentationWithConnectorTest
> testCounters(org.apache.camel.management.JmxInstrumentationWithConnectorTest)  
> Time elapsed: 7.609 sec <<< ERROR!
> java.io.IOException: Failed to retrieve RMIServer stub:
> javax.naming.NameNotFoundException: jmxrmi/camel
> at
> com.sun.jndi.rmi.registry.RegistryContext.lookup(RegistryContext.java:116)  
> at
> com.sun.jndi.toolkit.url.GenericURLContext.lookup(GenericURLContext.java:203)  
> at javax.naming.InitialContext.lookup(InitialContext.java:411)
> at
> javax.management.remote.rmi.RMIConnector.findRMIServerJNDI(RMIConnector.java:1925)  
> at
> javax.management.remote.rmi.RMIConnector.findRMIServer(RMIConnector.java:1892)  
> at javax.management.remote.rmi.RMIConnector.connect(RMIConnector.java:275)  
> at
> javax.management.remote.JMXConnectorFactory.connect(JMXConnectorFactory.java:268)  
> at
> org.apache.camel.management.JmxInstrumentationWithConnectorTest.getMBeanConnection(JmxInstrumentationWithConnectorTest.java:100)  
>  
>  
>  
>  
>  
>  
>  
> --
> View this message in context: http://camel.465427.n5.nabble.com/VOTE-Release-Apache-Camel-2-13-1-tp5750981p5750990.html 
> Sent from the Camel Development mailing list archive at Nabble.com.
>  



If you reply to this email, your message will be added to the discussion below:
http://camel.465427.n5.nabble.com/VOTE-Release-Apache-Camel-2-13-1-tp5750981p5750992.html
To unsubscribe from [VOTE] Release Apache Camel 2.13.1, click here.
NAML



--
Peter Keller
Wolfswinkel 12
8046 Zürich
P +44-370 18 09
M +78-626 92 89
Reply | Threaded
Open this post in threaded view
|

Re: [VOTE] Release Apache Camel 2.13.1

Christian Mueller
Administrator
In reply to this post by Willem.Jiang
+1

The manual looks good.
I could verify the signature and hash files.
I could also execute a "mvn clean install" without any issues.

Best,
Christian
-----------------

Software Integration Specialist

Apache Member
V.P. Apache Camel | Apache Camel PMC Member | Apache Camel committer
Apache Incubator PMC Member

https://www.linkedin.com/pub/christian-mueller/11/551/642


On Sun, May 11, 2014 at 9:06 AM, Willem Jiang <[hidden email]>wrote:

> I ran the unit tests with Camel in Action code (by upgrading the CXF
> version to 2.7.11 and Camel version to 2.13.1), all tests were passed.
>
> Here is my +1 for this vote.
>
> --
> Willem Jiang
>
> Red Hat, Inc.
> Web: http://www.redhat.com
> Blog: http://willemjiang.blogspot.com (English)
> http://jnn.iteye.com (Chinese)
> Twitter: willemjiang
> Weibo: 姜宁willem
>
>
>
> On May 9, 2014 at 10:07:56 PM, Willem Jiang ([hidden email])
> wrote:
> >
> >
> > This is a vote to release Apache Camel 2.13.1, a patch release coming
> > with about 72 issues fixed.
> >
> > Release notes:
> >
> https://issues.apache.org/jira/secure/ReleaseNote.jspa?version=12326053&styleName=&projectId=12311211
> >
> > Staging repo:
> > https://repository.apache.org/content/repositories/orgapachecamel-1008
> >
> > Tarballs:
> >
> https://repository.apache.org/content/repositories/orgapachecamel-1008/org/apache/camel/apache-camel/2.13.1/
> >
> > Tag:
> >
> https://git-wip-us.apache.org/repos/asf?p=camel.git;a=tag;h=40a6d95594324b1e7d7f24f92d4f4822ab2f83d0
> >
> > Please test this release candidate and cast your vote.
> > [ ] +1 Release the binary as Apache Camel 2.13.1
> > [ ] -1 Veto the release (provide specific comments)
> > Vote is open for at least 72 hours.
> >
> >
> > --
> > Willem Jiang
> >
> > Red Hat, Inc.
> > Web: http://www.redhat.com
> > Blog: http://willemjiang.blogspot.com (English)
> > http://jnn.iteye.com (Chinese)
> > Twitter: willemjiang
> > Weibo: 姜宁willem
> >
> >
> >
> >
> >
>
>
Reply | Threaded
Open this post in threaded view
|

Re: [VOTE] Release Apache Camel 2.13.1

Willem.Jiang
Administrator
In reply to this post by Peter Keller
I’m using oracle JDK 1.7.0_45 in Mac, I cannot reproduce the error.

Apache Maven 3.0.5 (r01de14724cdef164cd33c7c8c2fe155faf9602da; 2013-02-19 21:51:28+0800)
Maven home: /opt/apache-maven-3.0.5
Java version: 1.7.0_45, vendor: Oracle Corporation
Java home: /Library/Java/JavaVirtualMachines/jdk1.7.0_45.jdk/Contents/Home/jre
Default locale: en_US, platform encoding: UTF-8
OS name: "mac os x", version: "10.9.2", arch: "x86_64", family: "mac"


--  
Willem Jiang

Red Hat, Inc.
Web: http://www.redhat.com
Blog: http://willemjiang.blogspot.com (English)
http://jnn.iteye.com (Chinese)
Twitter: willemjiang  
Weibo: 姜宁willem



On May 12, 2014 at 3:25:09 AM, Peter Keller ([hidden email]) wrote:

> With "mvn clean install", I got following error when running the tests for
> the Camel :: JAXB module:
>  
> Failed tests:
>  
> JaxbDataFormatSchemaValidationSpringTest.testMarshallWithValidationException:79->Assert.assertTrue:52->Assert.assertTrue:41->Assert.fail:86  
> null
> JaxbDataFormatSchemaValidationSpringTest.testUnmarshallWithValidationException:122->Assert.assertTrue:52->Assert.assertTrue:41->Assert.fail:86  
> null
> JaxbDataFormatSchemaValidationTest.testMarshallWithValidationException:78->Assert.assertTrue:52->Assert.assertTrue:41->Assert.fail:86  
> null
> JaxbDataFormatSchemaValidationTest.testUnmarshallWithValidationException:121->Assert.assertTrue:52->Assert.assertTrue:41->Assert.fail:86  
> null
>  
> Tests run: 90, Failures: 4, Errors: 0, Skipped: 0
>  
>  
>  
> On Sun, May 11, 2014 at 7:05 PM, Willem.Jiang [via Camel] <
> [hidden email]> wrote:
>  
> > Hi Peter,
> >
> > Can you use "mvn clean install" to start the build again?
> > I ran the tests before I cut the camel 2.13.1.
> >
> >
> > --
> > Willem Jiang
> >
> > Red Hat, Inc.
> > Web: http://www.redhat.com
> > Blog: http://willemjiang.blogspot.com (English)
> > http://jnn.iteye.com (Chinese)
> > Twitter: willemjiang
> > Weibo: 姜宁willem
> >
> >
> >
> > On May 11, 2014 at 9:46:27 PM, Peter Keller ([hidden email])  
> > wrote:
> >
> > > -1
> > >
> > > I use MacOS with java version "1.7.0_40".
> > >
> > > I downloaded
> > >
> > http://repository.apache.org/content/repositories/orgapachecamel-1008/org/apache/camel/apache-camel/2.13.1/apache-camel-2.13.1-src.zip,  
> >
> > > executed "mvn install" and got following error:
> > >
> > > Running org.apache.camel.view.XmlGraphTest
> > > Tests run: 1, Failures: 0, Errors: 0, Skipped: 0, Time elapsed: 0.092
> > sec -
> > > in org.apache.camel.view.XmlGraphTest
> > >
> > > Results :
> > >
> > > Failed tests:
> > >
> > >
> > FileProducerRenameUsingCopyTest>TestSupport.runBare:58->testMove:41->ContextTestSupport.assertMockEndpointsSatisfied:343  
> >
> > > mock://result Content of file: target/file/done/hello.txt. Expected: >
> > Camel> but was: <>
> > >
> > > Tests run: 4902, Failures: 1, Errors: 0, Skipped: 3
> > >
> > > I re-exucuted "mvn install" and got several errors of following type:
> > >
> > > Tests run: 3, Failures: 0, Errors: 0, Skipped: 0, Time elapsed: 0.077
> > sec -
> > > in org.apache.camel.management.JmxInstrumentationUsingPropertiesTest
> > > Running org.apache.camel.management.JmxInstrumentationWithConnectorTest  
> > > Tests run: 3, Failures: 0, Errors: 1, Skipped: 0, Time elapsed: 942.325
> > sec
> > > <<< FAILURE! - in
> > > org.apache.camel.management.JmxInstrumentationWithConnectorTest
> > >
> > testCounters(org.apache.camel.management.JmxInstrumentationWithConnectorTest)  
> >
> > > Time elapsed: 7.609 sec <<< ERROR!
> > > java.io.IOException: Failed to retrieve RMIServer stub:
> > > javax.naming.NameNotFoundException: jmxrmi/camel
> > > at
> > >
> > com.sun.jndi.rmi.registry.RegistryContext.lookup(RegistryContext.java:116)  
> >
> > > at
> > >
> > com.sun.jndi.toolkit.url.GenericURLContext.lookup(GenericURLContext.java:203)  
> >
> > > at javax.naming.InitialContext.lookup(InitialContext.java:411)
> > > at
> > >
> > javax.management.remote.rmi.RMIConnector.findRMIServerJNDI(RMIConnector.java:1925)  
> >
> > > at
> > >
> > javax.management.remote.rmi.RMIConnector.findRMIServer(RMIConnector.java:1892)  
> >
> > > at
> > javax.management.remote.rmi.RMIConnector.connect(RMIConnector.java:275)  
> > > at
> > >
> > javax.management.remote.JMXConnectorFactory.connect(JMXConnectorFactory.java:268)  
> >
> > > at
> > >
> > org.apache.camel.management.JmxInstrumentationWithConnectorTest.getMBeanConnection(JmxInstrumentationWithConnectorTest.java:100)  
> >
> > >
> > >
> > >
> > >
> > >
> > >
> > >
> > > --
> > > View this message in context:
> > http://camel.465427.n5.nabble.com/VOTE-Release-Apache-Camel-2-13-1-tp5750981p5750990.html 
> >
> > > Sent from the Camel Development mailing list archive at Nabble.com.
> > >
> >
> >
> >
> > ------------------------------
> > If you reply to this email, your message will be added to the discussion
> > below:
> >
> > http://camel.465427.n5.nabble.com/VOTE-Release-Apache-Camel-2-13-1-tp5750981p5750992.html 
> > To unsubscribe from [VOTE] Release Apache Camel 2.13.1, click here  
> > .
> > NAML  
> >
>  
>  
>  
> --
> Peter Keller
> Wolfswinkel 12
> 8046 Zürich
> P +44-370 18 09
> M +78-626 92 89
>  
>  
>  
>  
> --
> View this message in context: http://camel.465427.n5.nabble.com/VOTE-Release-Apache-Camel-2-13-1-tp5750981p5750995.html 
> Sent from the Camel Development mailing list archive at Nabble.com.

Reply | Threaded
Open this post in threaded view
|

Re: [VOTE] Release Apache Camel 2.13.1

Willem.Jiang
Administrator
In reply to this post by Peter Keller
Hi Peter,

Can you revert your -1?

I ran the tests before I cut the Camel 2.13.1, and Christian verified the source with “mvn clean install”, he didn’t find any issue.

--  
Willem Jiang

Red Hat, Inc.
Web: http://www.redhat.com
Blog: http://willemjiang.blogspot.com (English)
http://jnn.iteye.com (Chinese)
Twitter: willemjiang  
Weibo: 姜宁willem



On May 11, 2014 at 9:46:27 PM, Peter Keller ([hidden email]) wrote:

> -1
>  
> I use MacOS with java version "1.7.0_40".
>  
> I downloaded
> http://repository.apache.org/content/repositories/orgapachecamel-1008/org/apache/camel/apache-camel/2.13.1/apache-camel-2.13.1-src.zip,  
> executed "mvn install" and got following error:
>  
> Running org.apache.camel.view.XmlGraphTest
> Tests run: 1, Failures: 0, Errors: 0, Skipped: 0, Time elapsed: 0.092 sec -
> in org.apache.camel.view.XmlGraphTest
>  
> Results :
>  
> Failed tests:
>  
> FileProducerRenameUsingCopyTest>TestSupport.runBare:58->testMove:41->ContextTestSupport.assertMockEndpointsSatisfied:343  
> mock://result Content of file: target/file/done/hello.txt. Expected: > Camel> but was: <>
>  
> Tests run: 4902, Failures: 1, Errors: 0, Skipped: 3
>  
> I re-exucuted "mvn install" and got several errors of following type:
>  
> Tests run: 3, Failures: 0, Errors: 0, Skipped: 0, Time elapsed: 0.077 sec -
> in org.apache.camel.management.JmxInstrumentationUsingPropertiesTest
> Running org.apache.camel.management.JmxInstrumentationWithConnectorTest
> Tests run: 3, Failures: 0, Errors: 1, Skipped: 0, Time elapsed: 942.325 sec
> <<< FAILURE! - in
> org.apache.camel.management.JmxInstrumentationWithConnectorTest
> testCounters(org.apache.camel.management.JmxInstrumentationWithConnectorTest)  
> Time elapsed: 7.609 sec <<< ERROR!
> java.io.IOException: Failed to retrieve RMIServer stub:
> javax.naming.NameNotFoundException: jmxrmi/camel
> at
> com.sun.jndi.rmi.registry.RegistryContext.lookup(RegistryContext.java:116)  
> at
> com.sun.jndi.toolkit.url.GenericURLContext.lookup(GenericURLContext.java:203)  
> at javax.naming.InitialContext.lookup(InitialContext.java:411)
> at
> javax.management.remote.rmi.RMIConnector.findRMIServerJNDI(RMIConnector.java:1925)  
> at
> javax.management.remote.rmi.RMIConnector.findRMIServer(RMIConnector.java:1892)  
> at javax.management.remote.rmi.RMIConnector.connect(RMIConnector.java:275)  
> at
> javax.management.remote.JMXConnectorFactory.connect(JMXConnectorFactory.java:268)  
> at
> org.apache.camel.management.JmxInstrumentationWithConnectorTest.getMBeanConnection(JmxInstrumentationWithConnectorTest.java:100)  
>  
>  
>  
>  
>  
>  
>  
> --
> View this message in context: http://camel.465427.n5.nabble.com/VOTE-Release-Apache-Camel-2-13-1-tp5750981p5750990.html 
> Sent from the Camel Development mailing list archive at Nabble.com.
>  

Reply | Threaded
Open this post in threaded view
|

Re: [VOTE] Release Apache Camel 2.13.1

Gregor Zurowski-3
It does not compile on my Windows box due to a recently added unit test in
class DefaultTraceEventMessageTest:

========================================================
Results :

Failed tests:

DefaultTraceEventMessageTest>TestSupport.runBare:58->testDefaultTraceEventMessageBody:79
Get a wrong body string expected:<...s file based: target[/]test]> but
was:<...s file based: target[\]test]>

Tests run: 4902, Failures: 1, Errors: 0, Skipped: 3

[INFO]
------------------------------------------------------------------------
[INFO] Reactor Summary:
[INFO]
[INFO] Camel ............................................. SUCCESS [1.165s]
[...]
[INFO] Camel :: Core ..................................... FAILURE
[22:46.800s]
========================================================

An assertion in the test assumes Unix path separators which obviously does
not work with Windows. I have submitted the following PR that fixes this
issue:

https://github.com/apache/camel/pull/149

Note that functionality is not affected, only the unit test is broken on
Windows.

Thanks,
Gregor


On Sun, May 11, 2014 at 8:29 PM, Willem Jiang <[hidden email]>wrote:

> Hi Peter,
>
> Can you revert your -1?
>
> I ran the tests before I cut the Camel 2.13.1, and Christian verified the
> source with “mvn clean install”, he didn’t find any issue.
>
> --
> Willem Jiang
>
> Red Hat, Inc.
> Web: http://www.redhat.com
> Blog: http://willemjiang.blogspot.com (English)
> http://jnn.iteye.com (Chinese)
> Twitter: willemjiang
> Weibo: 姜宁willem
>
>
>
> On May 11, 2014 at 9:46:27 PM, Peter Keller ([hidden email]) wrote:
> > -1
> >
> > I use MacOS with java version "1.7.0_40".
> >
> > I downloaded
> >
> http://repository.apache.org/content/repositories/orgapachecamel-1008/org/apache/camel/apache-camel/2.13.1/apache-camel-2.13.1-src.zip
> ,
> > executed "mvn install" and got following error:
> >
> > Running org.apache.camel.view.XmlGraphTest
> > Tests run: 1, Failures: 0, Errors: 0, Skipped: 0, Time elapsed: 0.092
> sec -
> > in org.apache.camel.view.XmlGraphTest
> >
> > Results :
> >
> > Failed tests:
> >
> >
> FileProducerRenameUsingCopyTest>TestSupport.runBare:58->testMove:41->ContextTestSupport.assertMockEndpointsSatisfied:343
> > mock://result Content of file: target/file/done/hello.txt. Expected: >
> Camel> but was: <>
> >
> > Tests run: 4902, Failures: 1, Errors: 0, Skipped: 3
> >
> > I re-exucuted "mvn install" and got several errors of following type:
> >
> > Tests run: 3, Failures: 0, Errors: 0, Skipped: 0, Time elapsed: 0.077
> sec -
> > in org.apache.camel.management.JmxInstrumentationUsingPropertiesTest
> > Running org.apache.camel.management.JmxInstrumentationWithConnectorTest
> > Tests run: 3, Failures: 0, Errors: 1, Skipped: 0, Time elapsed: 942.325
> sec
> > <<< FAILURE! - in
> > org.apache.camel.management.JmxInstrumentationWithConnectorTest
> >
> testCounters(org.apache.camel.management.JmxInstrumentationWithConnectorTest)
> > Time elapsed: 7.609 sec <<< ERROR!
> > java.io.IOException: Failed to retrieve RMIServer stub:
> > javax.naming.NameNotFoundException: jmxrmi/camel
> > at
> >
> com.sun.jndi.rmi.registry.RegistryContext.lookup(RegistryContext.java:116)
> > at
> >
> com.sun.jndi.toolkit.url.GenericURLContext.lookup(GenericURLContext.java:203)
> > at javax.naming.InitialContext.lookup(InitialContext.java:411)
> > at
> >
> javax.management.remote.rmi.RMIConnector.findRMIServerJNDI(RMIConnector.java:1925)
> > at
> >
> javax.management.remote.rmi.RMIConnector.findRMIServer(RMIConnector.java:1892)
> > at
> javax.management.remote.rmi.RMIConnector.connect(RMIConnector.java:275)
> > at
> >
> javax.management.remote.JMXConnectorFactory.connect(JMXConnectorFactory.java:268)
> > at
> >
> org.apache.camel.management.JmxInstrumentationWithConnectorTest.getMBeanConnection(JmxInstrumentationWithConnectorTest.java:100)
> >
> >
> >
> >
> >
> >
> >
> > --
> > View this message in context:
> http://camel.465427.n5.nabble.com/VOTE-Release-Apache-Camel-2-13-1-tp5750981p5750990.html
> > Sent from the Camel Development mailing list archive at Nabble.com.
> >
>
>
Reply | Threaded
Open this post in threaded view
|

Re: [VOTE] Release Apache Camel 2.13.1

Willem.Jiang
Administrator
Thanks for that.
I just merged the pull request.

--  
Willem Jiang

Red Hat, Inc.
Web: http://www.redhat.com
Blog: http://willemjiang.blogspot.com (English)
http://jnn.iteye.com (Chinese)
Twitter: willemjiang  
Weibo: 姜宁willem



On May 12, 2014 at 1:08:48 PM, Gregor Zurowski ([hidden email]) wrote:

> It does not compile on my Windows box due to a recently added unit test in
> class DefaultTraceEventMessageTest:
>  
> ========================================================
> Results :
>  
> Failed tests:
>  
> DefaultTraceEventMessageTest>TestSupport.runBare:58->testDefaultTraceEventMessageBody:79  
> Get a wrong body string expected:<...s file based: target[/]test]> but
> was:<...s file based: target[\]test]>
>  
> Tests run: 4902, Failures: 1, Errors: 0, Skipped: 3
>  
> [INFO]
> ------------------------------------------------------------------------  
> [INFO] Reactor Summary:
> [INFO]
> [INFO] Camel ............................................. SUCCESS [1.165s]  
> [...]
> [INFO] Camel :: Core ..................................... FAILURE
> [22:46.800s]
> ========================================================
>  
> An assertion in the test assumes Unix path separators which obviously does
> not work with Windows. I have submitted the following PR that fixes this
> issue:
>  
> https://github.com/apache/camel/pull/149
>  
> Note that functionality is not affected, only the unit test is broken on
> Windows.
>  
> Thanks,
> Gregor
>  
>  
> On Sun, May 11, 2014 at 8:29 PM, Willem Jiang wrote:
>  
> > Hi Peter,
> >
> > Can you revert your -1?
> >
> > I ran the tests before I cut the Camel 2.13.1, and Christian verified the
> > source with “mvn clean install”, he didn’t find any issue.
> >
> > --
> > Willem Jiang
> >
> > Red Hat, Inc.
> > Web: http://www.redhat.com
> > Blog: http://willemjiang.blogspot.com (English)
> > http://jnn.iteye.com (Chinese)
> > Twitter: willemjiang
> > Weibo: 姜宁willem
> >
> >
> >
> > On May 11, 2014 at 9:46:27 PM, Peter Keller ([hidden email]) wrote:
> > > -1
> > >
> > > I use MacOS with java version "1.7.0_40".
> > >
> > > I downloaded
> > >
> > http://repository.apache.org/content/repositories/orgapachecamel-1008/org/apache/camel/apache-camel/2.13.1/apache-camel-2.13.1-src.zip 
> > ,
> > > executed "mvn install" and got following error:
> > >
> > > Running org.apache.camel.view.XmlGraphTest
> > > Tests run: 1, Failures: 0, Errors: 0, Skipped: 0, Time elapsed: 0.092
> > sec -
> > > in org.apache.camel.view.XmlGraphTest
> > >
> > > Results :
> > >
> > > Failed tests:
> > >
> > >
> > FileProducerRenameUsingCopyTest>TestSupport.runBare:58->testMove:41->ContextTestSupport.assertMockEndpointsSatisfied:343  
> > > mock://result Content of file: target/file/done/hello.txt. Expected: >
> > Camel> but was: <>
> > >
> > > Tests run: 4902, Failures: 1, Errors: 0, Skipped: 3
> > >
> > > I re-exucuted "mvn install" and got several errors of following type:
> > >
> > > Tests run: 3, Failures: 0, Errors: 0, Skipped: 0, Time elapsed: 0.077
> > sec -
> > > in org.apache.camel.management.JmxInstrumentationUsingPropertiesTest
> > > Running org.apache.camel.management.JmxInstrumentationWithConnectorTest  
> > > Tests run: 3, Failures: 0, Errors: 1, Skipped: 0, Time elapsed: 942.325
> > sec
> > > <<< FAILURE! - in
> > > org.apache.camel.management.JmxInstrumentationWithConnectorTest
> > >
> > testCounters(org.apache.camel.management.JmxInstrumentationWithConnectorTest)  
> > > Time elapsed: 7.609 sec <<< ERROR!
> > > java.io.IOException: Failed to retrieve RMIServer stub:
> > > javax.naming.NameNotFoundException: jmxrmi/camel
> > > at
> > >
> > com.sun.jndi.rmi.registry.RegistryContext.lookup(RegistryContext.java:116)  
> > > at
> > >
> > com.sun.jndi.toolkit.url.GenericURLContext.lookup(GenericURLContext.java:203)  
> > > at javax.naming.InitialContext.lookup(InitialContext.java:411)
> > > at
> > >
> > javax.management.remote.rmi.RMIConnector.findRMIServerJNDI(RMIConnector.java:1925)  
> > > at
> > >
> > javax.management.remote.rmi.RMIConnector.findRMIServer(RMIConnector.java:1892)  
> > > at
> > javax.management.remote.rmi.RMIConnector.connect(RMIConnector.java:275)  
> > > at
> > >
> > javax.management.remote.JMXConnectorFactory.connect(JMXConnectorFactory.java:268)  
> > > at
> > >
> > org.apache.camel.management.JmxInstrumentationWithConnectorTest.getMBeanConnection(JmxInstrumentationWithConnectorTest.java:100)  
> > >
> > >
> > >
> > >
> > >
> > >
> > >
> > > --
> > > View this message in context:
> > http://camel.465427.n5.nabble.com/VOTE-Release-Apache-Camel-2-13-1-tp5750981p5750990.html 
> > > Sent from the Camel Development mailing list archive at Nabble.com.
> > >
> >
> >
>  

Reply | Threaded
Open this post in threaded view
|

Re: [VOTE] Release Apache Camel 2.13.1

Peter Keller
In reply to this post by Christian Mueller


On Sun, May 11, 2014 at 10:13 PM, Christian Mueller [via Camel] <[hidden email]> wrote:
+1

The manual looks good.
I could verify the signature and hash files.
I could also execute a "mvn clean install" without any issues.

Best,
Christian
-----------------

Software Integration Specialist

Apache Member
V.P. Apache Camel | Apache Camel PMC Member | Apache Camel committer
Apache Incubator PMC Member

https://www.linkedin.com/pub/christian-mueller/11/551/642


On Sun, May 11, 2014 at 9:06 AM, Willem Jiang <[hidden email]>wrote:

> I ran the unit tests with Camel in Action code (by upgrading the CXF
> version to 2.7.11 and Camel version to 2.13.1), all tests were passed.
>
> Here is my +1 for this vote.
>
> --
> Willem Jiang
>
> Red Hat, Inc.
> Web: http://www.redhat.com
> Blog: http://willemjiang.blogspot.com (English)
> http://jnn.iteye.com (Chinese)
> Twitter: willemjiang
> Weibo: 姜宁willem
>
>
>
> On May 9, 2014 at 10:07:56 PM, Willem Jiang ([hidden email])
> wrote:
> >
> >
> > This is a vote to release Apache Camel 2.13.1, a patch release coming
> > with about 72 issues fixed.
> >
> > Release notes:
> >
> https://issues.apache.org/jira/secure/ReleaseNote.jspa?version=12326053&styleName=&projectId=12311211
> >
> > Staging repo:
> > https://repository.apache.org/content/repositories/orgapachecamel-1008
> >
> > Tarballs:
> >
> https://repository.apache.org/content/repositories/orgapachecamel-1008/org/apache/camel/apache-camel/2.13.1/
> >
> > Tag:
> >
> https://git-wip-us.apache.org/repos/asf?p=camel.git;a=tag;h=40a6d95594324b1e7d7f24f92d4f4822ab2f83d0
> >

> > Please test this release candidate and cast your vote.
> > [ ] +1 Release the binary as Apache Camel 2.13.1
> > [ ] -1 Veto the release (provide specific comments)
> > Vote is open for at least 72 hours.
> >
> >
> > --
> > Willem Jiang
> >
> > Red Hat, Inc.
> > Web: http://www.redhat.com
> > Blog: http://willemjiang.blogspot.com (English)
> > http://jnn.iteye.com (Chinese)
> > Twitter: willemjiang
> > Weibo: 姜宁willem
> >
> >
> >
> >
> >
>
>



If you reply to this email, your message will be added to the discussion below:
http://camel.465427.n5.nabble.com/VOTE-Release-Apache-Camel-2-13-1-tp5750981p5750996.html
To unsubscribe from [VOTE] Release Apache Camel 2.13.1, click here.
NAML



--
Peter Keller
Wolfswinkel 12
8046 Zürich
P +44-370 18 09
M +78-626 92 89
Reply | Threaded
Open this post in threaded view
|

Re: [VOTE] Release Apache Camel 2.13.1

Peter Keller
+1 If somebody else can confirm that he or she could run all tests on MacOS
starting from
http://repository.apache.org/content/repositories/orgapachecamel-1008/org/apache/camel/apache-camel/2.13.1/apache-camel-2.13.1-src.zip


On Mon, May 12, 2014 at 10:41 AM, Peter Keller <[hidden email]> wrote:

> I started with the source from
>
> http://repository.apache.org/content/repositories/orgapachecamel-1008/org/apache/camel/apache-camel/2.13.1/apache-camel-2.13.1-src.zip
> .
> Christian, did you also use these sources?
>
>
> On Sun, May 11, 2014 at 10:13 PM, Christian Mueller [via Camel] <
> [hidden email]> wrote:
>
> > +1
> >
> > The manual looks good.
> > I could verify the signature and hash files.
> > I could also execute a "mvn clean install" without any issues.
> >
> > Best,
> > Christian
> > -----------------
> >
> > Software Integration Specialist
> >
> > Apache Member
> > V.P. Apache Camel | Apache Camel PMC Member | Apache Camel committer
> > Apache Incubator PMC Member
> >
> > https://www.linkedin.com/pub/christian-mueller/11/551/642
> >
> >
> > On Sun, May 11, 2014 at 9:06 AM, Willem Jiang <[hidden email]<
> http://user/SendEmail.jtp?type=node&node=5750996&i=0>>wrote:
> >
> >
> > > I ran the unit tests with Camel in Action code (by upgrading the CXF
> > > version to 2.7.11 and Camel version to 2.13.1), all tests were passed.
> > >
> > > Here is my +1 for this vote.
> > >
> > > --
> > > Willem Jiang
> > >
> > > Red Hat, Inc.
> > > Web: http://www.redhat.com
> > > Blog: http://willemjiang.blogspot.com (English)
> > > http://jnn.iteye.com (Chinese)
> > > Twitter: willemjiang
> > > Weibo: 姜宁willem
> > >
> > >
> > >
> > > On May 9, 2014 at 10:07:56 PM, Willem Jiang ([hidden email]<
> http://user/SendEmail.jtp?type=node&node=5750996&i=1>)
> >
> > > wrote:
> > > >
> > > >
> > > > This is a vote to release Apache Camel 2.13.1, a patch release coming
> > > > with about 72 issues fixed.
> > > >
> > > > Release notes:
> > > >
> > >
> >
> https://issues.apache.org/jira/secure/ReleaseNote.jspa?version=12326053&styleName=&projectId=12311211
> > > >
> > > > Staging repo:
> > > >
> https://repository.apache.org/content/repositories/orgapachecamel-1008
> > > >
> > > > Tarballs:
> > > >
> > >
> >
> https://repository.apache.org/content/repositories/orgapachecamel-1008/org/apache/camel/apache-camel/2.13.1/
> > > >
> > > > Tag:
> > > >
> > >
> >
> https://git-wip-us.apache.org/repos/asf?p=camel.git;a=tag;h=40a6d95594324b1e7d7f24f92d4f4822ab2f83d0
> > > >
> > > > Please test this release candidate and cast your vote.
> > > > [ ] +1 Release the binary as Apache Camel 2.13.1
> > > > [ ] -1 Veto the release (provide specific comments)
> > > > Vote is open for at least 72 hours.
> > > >
> > > >
> > > > --
> > > > Willem Jiang
> > > >
> > > > Red Hat, Inc.
> > > > Web: http://www.redhat.com
> > > > Blog: http://willemjiang.blogspot.com (English)
> > > > http://jnn.iteye.com (Chinese)
> > > > Twitter: willemjiang
> > > > Weibo: 姜宁willem
> > > >
> > > >
> > > >
> > > >
> > > >
> > >
> > >
> >
> >
> > ------------------------------
> >  If you reply to this email, your message will be added to the discussion
> > below:
> >
> >
> http://camel.465427.n5.nabble.com/VOTE-Release-Apache-Camel-2-13-1-tp5750981p5750996.html
> >  To unsubscribe from [VOTE] Release Apache Camel 2.13.1, click here<
> >
> > .
> > NAML<
>
http://camel.465427.n5.nabble.com/template/NamlServlet.jtp?macro=macro_viewer&id=instant_html%21nabble%3Aemail.naml&base=nabble.naml.namespaces.BasicNamespace-nabble.view.web.template.NabbleNamespace-nabble.view.web.template.NodeNamespace&breadcrumbs=notify_subscribers%21nabble%3Aemail.naml-instant_emails%21nabble%3Aemail.naml-send_instant_email%21nabble%3Aemail.naml
> >
> >
>
>
>
> --
> Peter Keller
> Wolfswinkel 12
> 8046 Zürich
> P +44-370 18 09
> M +78-626 92 89
>
>
>
>
> --
> View this message in context:
> http://camel.465427.n5.nabble.com/VOTE-Release-Apache-Camel-2-13-1-tp5750981p5751016.html
> Sent from the Camel Development mailing list archive at Nabble.com.
>



--
Peter Keller
Wolfswinkel 12
8046 Zürich
P +44-370 18 09
M +78-626 92 89
Reply | Threaded
Open this post in threaded view
|

Re: [VOTE] Release Apache Camel 2.13.1

Babak Vahdat
In reply to this post by Willem.Jiang
+1

Verified the functionality of 4 distribution examples which I've touched recently in the past:

- camel-example-etl
- camel-example-mybatis
- camel-example-route-throttling
- camel-example-guice-jms (CAMEL-7038)

Babak
Willem.Jiang wrote
This is a vote to release Apache Camel 2.13.1, a patch release coming  
with about 72 issues fixed.  

Release notes:  
https://issues.apache.org/jira/secure/ReleaseNote.jspa?version=12326053&styleName=&projectId=12311211 

Staging repo:  
https://repository.apache.org/content/repositories/orgapachecamel-1008  

Tarballs:  
https://repository.apache.org/content/repositories/orgapachecamel-1008/org/apache/camel/apache-camel/2.13.1/  

Tag:  
https://git-wip-us.apache.org/repos/asf?p=camel.git;a=tag;h=40a6d95594324b1e7d7f24f92d4f4822ab2f83d0 

Please test this release candidate and cast your vote.  
[ ] +1 Release the binary as Apache Camel 2.13.1  
[ ] -1 Veto the release (provide specific comments)  
Vote is open for at least 72 hours.  


--  
Willem Jiang

Red Hat, Inc.
Web: http://www.redhat.com
Blog: http://willemjiang.blogspot.com (English)
http://jnn.iteye.com (Chinese)
Twitter: willemjiang  
Weibo: 姜宁willem
Reply | Threaded
Open this post in threaded view
|

Re: [VOTE] Release Apache Camel 2.13.1

Aki Yoshida-3
In reply to this post by Willem.Jiang
+1 (non-binding)

used the tarball 2.13.1-src and ran the whole unit tests with OSX JDK 1.7.0_51.
also ran some cxf manual tests with karaf using camel features.
looked all good.

regards, aki

2014-05-08 3:48 GMT+02:00 Willem Jiang <[hidden email]>:

>
> This is a vote to release Apache Camel 2.13.1, a patch release coming
> with about 72 issues fixed.
>
> Release notes:
> https://issues.apache.org/jira/secure/ReleaseNote.jspa?version=12326053&styleName=&projectId=12311211
>
> Staging repo:
> https://repository.apache.org/content/repositories/orgapachecamel-1008
>
> Tarballs:
> https://repository.apache.org/content/repositories/orgapachecamel-1008/org/apache/camel/apache-camel/2.13.1/
>
> Tag:
> https://git-wip-us.apache.org/repos/asf?p=camel.git;a=tag;h=40a6d95594324b1e7d7f24f92d4f4822ab2f83d0
>
> Please test this release candidate and cast your vote.
> [ ] +1 Release the binary as Apache Camel 2.13.1
> [ ] -1 Veto the release (provide specific comments)
> Vote is open for at least 72 hours.
>
>
> --
> Willem Jiang
>
> Red Hat, Inc.
> Web: http://www.redhat.com
> Blog: http://willemjiang.blogspot.com (English)
> http://jnn.iteye.com (Chinese)
> Twitter: willemjiang
> Weibo: 姜宁willem
>
>
>
Reply | Threaded
Open this post in threaded view
|

Re: [VOTE] Release Apache Camel 2.13.1

Willem.Jiang
Administrator
In reply to this post by Willem.Jiang
Hi,

This vote is passed with 
binding +1 ningjiang, davsclaus, cmueller,bvahdat
no-binding +1 ay, Peter Keller.

I will just push stage maven artefacts shortly, and send out release mail once the release files are synced.

--  
Willem Jiang

Red Hat, Inc.
Web: http://www.redhat.com
Blog: http://willemjiang.blogspot.com (English)
http://jnn.iteye.com (Chinese)
Twitter: willemjiang  
Weibo: 姜宁willem



On May 8, 2014 at 9:48:14 AM, Willem Jiang ([hidden email]) wrote:

>  
> This is a vote to release Apache Camel 2.13.1, a patch release coming
> with about 72 issues fixed.
>  
> Release notes:
> https://issues.apache.org/jira/secure/ReleaseNote.jspa?version=12326053&styleName=&projectId=12311211 
>  
> Staging repo:
> https://repository.apache.org/content/repositories/orgapachecamel-1008
>  
> Tarballs:
> https://repository.apache.org/content/repositories/orgapachecamel-1008/org/apache/camel/apache-camel/2.13.1/ 
>  
> Tag:
> https://git-wip-us.apache.org/repos/asf?p=camel.git;a=tag;h=40a6d95594324b1e7d7f24f92d4f4822ab2f83d0 
>  
> Please test this release candidate and cast your vote.
> [ ] +1 Release the binary as Apache Camel 2.13.1
> [ ] -1 Veto the release (provide specific comments)
> Vote is open for at least 72 hours.
>  
>  
> --
> Willem Jiang
>  
> Red Hat, Inc.
> Web: http://www.redhat.com
> Blog: http://willemjiang.blogspot.com (English)
> http://jnn.iteye.com (Chinese)
> Twitter: willemjiang
> Weibo: 姜宁willem
>  
>  
>  
>  

Reply | Threaded
Open this post in threaded view
|

Re: [VOTE] Release Apache Camel 2.13.1

Gregor Zurowski-3
In reply to this post by Willem.Jiang
+1 (non-binding)

@Willem: Thanks for merging my PR.

I was able to build 2.13.1 with the following setup:

Apache Maven 3.1.1 (0728685237757ffbf44136acec0402957f723d9a; 2013-09-17
11:22:22-0400)
Maven home: C:\dev\maven-3.1.1
Java version: 1.7.0_55, vendor: Oracle Corporation
Java home: c:\dev\jdk-1.7\jre
Default locale: en_US, platform encoding: Cp1252
OS name: "windows 8.1", version: "6.3", arch: "amd64", family: "windows"

Please note that I had to disable test "setJobName" in class
PrinterPrintTest as it does not seem to work on Windows with JDK 1.7. I
will need to further investigate, but definitely not a problem that was
recently introduced with 2.13.1.


On Mon, May 12, 2014 at 4:06 AM, Willem Jiang <[hidden email]>wrote:

> Thanks for that.
> I just merged the pull request.
>
> --
> Willem Jiang
>
> Red Hat, Inc.
> Web: http://www.redhat.com
> Blog: http://willemjiang.blogspot.com (English)
> http://jnn.iteye.com (Chinese)
> Twitter: willemjiang
> Weibo: 姜宁willem
>
>
>
> On May 12, 2014 at 1:08:48 PM, Gregor Zurowski ([hidden email])
> wrote:
> > It does not compile on my Windows box due to a recently added unit test
> in
> > class DefaultTraceEventMessageTest:
> >
> > ========================================================
> > Results :
> >
> > Failed tests:
> >
> >
> DefaultTraceEventMessageTest>TestSupport.runBare:58->testDefaultTraceEventMessageBody:79
> > Get a wrong body string expected:<...s file based: target[/]test]> but
> > was:<...s file based: target[\]test]>
> >
> > Tests run: 4902, Failures: 1, Errors: 0, Skipped: 3
> >
> > [INFO]
> > ------------------------------------------------------------------------
> > [INFO] Reactor Summary:
> > [INFO]
> > [INFO] Camel ............................................. SUCCESS
> [1.165s]
> > [...]
> > [INFO] Camel :: Core ..................................... FAILURE
> > [22:46.800s]
> > ========================================================
> >
> > An assertion in the test assumes Unix path separators which obviously
> does
> > not work with Windows. I have submitted the following PR that fixes this
> > issue:
> >
> > https://github.com/apache/camel/pull/149
> >
> > Note that functionality is not affected, only the unit test is broken on
> > Windows.
> >
> > Thanks,
> > Gregor
> >
> >
> > On Sun, May 11, 2014 at 8:29 PM, Willem Jiang wrote:
> >
> > > Hi Peter,
> > >
> > > Can you revert your -1?
> > >
> > > I ran the tests before I cut the Camel 2.13.1, and Christian verified
> the
> > > source with “mvn clean install”, he didn’t find any issue.
> > >
> > > --
> > > Willem Jiang
> > >
> > > Red Hat, Inc.
> > > Web: http://www.redhat.com
> > > Blog: http://willemjiang.blogspot.com (English)
> > > http://jnn.iteye.com (Chinese)
> > > Twitter: willemjiang
> > > Weibo: 姜宁willem
> > >
> > >
> > >
> > > On May 11, 2014 at 9:46:27 PM, Peter Keller ([hidden email])
> wrote:
> > > > -1
> > > >
> > > > I use MacOS with java version "1.7.0_40".
> > > >
> > > > I downloaded
> > > >
> > >
> http://repository.apache.org/content/repositories/orgapachecamel-1008/org/apache/camel/apache-camel/2.13.1/apache-camel-2.13.1-src.zip
> > > ,
> > > > executed "mvn install" and got following error:
> > > >
> > > > Running org.apache.camel.view.XmlGraphTest
> > > > Tests run: 1, Failures: 0, Errors: 0, Skipped: 0, Time elapsed: 0.092
> > > sec -
> > > > in org.apache.camel.view.XmlGraphTest
> > > >
> > > > Results :
> > > >
> > > > Failed tests:
> > > >
> > > >
> > >
> FileProducerRenameUsingCopyTest>TestSupport.runBare:58->testMove:41->ContextTestSupport.assertMockEndpointsSatisfied:343
> > > > mock://result Content of file: target/file/done/hello.txt. Expected:
> >
> > > Camel> but was: <>
> > > >
> > > > Tests run: 4902, Failures: 1, Errors: 0, Skipped: 3
> > > >
> > > > I re-exucuted "mvn install" and got several errors of following type:
> > > >
> > > > Tests run: 3, Failures: 0, Errors: 0, Skipped: 0, Time elapsed: 0.077
> > > sec -
> > > > in org.apache.camel.management.JmxInstrumentationUsingPropertiesTest
> > > > Running
> org.apache.camel.management.JmxInstrumentationWithConnectorTest
> > > > Tests run: 3, Failures: 0, Errors: 1, Skipped: 0, Time elapsed:
> 942.325
> > > sec
> > > > <<< FAILURE! - in
> > > > org.apache.camel.management.JmxInstrumentationWithConnectorTest
> > > >
> > >
> testCounters(org.apache.camel.management.JmxInstrumentationWithConnectorTest)
> > > > Time elapsed: 7.609 sec <<< ERROR!
> > > > java.io.IOException: Failed to retrieve RMIServer stub:
> > > > javax.naming.NameNotFoundException: jmxrmi/camel
> > > > at
> > > >
> > >
> com.sun.jndi.rmi.registry.RegistryContext.lookup(RegistryContext.java:116)
> > > > at
> > > >
> > >
> com.sun.jndi.toolkit.url.GenericURLContext.lookup(GenericURLContext.java:203)
> > > > at javax.naming.InitialContext.lookup(InitialContext.java:411)
> > > > at
> > > >
> > >
> javax.management.remote.rmi.RMIConnector.findRMIServerJNDI(RMIConnector.java:1925)
> > > > at
> > > >
> > >
> javax.management.remote.rmi.RMIConnector.findRMIServer(RMIConnector.java:1892)
> > > > at
> > > javax.management.remote.rmi.RMIConnector.connect(RMIConnector.java:275)
> > > > at
> > > >
> > >
> javax.management.remote.JMXConnectorFactory.connect(JMXConnectorFactory.java:268)
> > > > at
> > > >
> > >
> org.apache.camel.management.JmxInstrumentationWithConnectorTest.getMBeanConnection(JmxInstrumentationWithConnectorTest.java:100)
> > > >
> > > >
> > > >
> > > >
> > > >
> > > >
> > > >
> > > > --
> > > > View this message in context:
> > >
> http://camel.465427.n5.nabble.com/VOTE-Release-Apache-Camel-2-13-1-tp5750981p5750990.html
> > > > Sent from the Camel Development mailing list archive at Nabble.com.
> > > >
> > >
> > >
> >
>
>