[jira] Created: (CAMEL-58) build seems broken

classic Classic list List threaded Threaded
2 messages Options
Reply | Threaded
Open this post in threaded view
|

[jira] Created: (CAMEL-58) build seems broken

JIRA jira@apache.org
build seems broken
------------------

                 Key: CAMEL-58
                 URL: https://issues.apache.org/activemq/browse/CAMEL-58
             Project: Apache Camel
          Issue Type: Sub-task
            Reporter: James Strachan
            Assignee: Jonas Lim
            Priority: Blocker



ERROR:  'null'
FATAL ERROR:  'Could not compile stylesheet'
javax.xml.transform.TransformerConfigurationException: Could not compile stylesheet
        at com.sun.org.apache.xalan.internal.xsltc.trax.TransformerFactoryImpl.newTemplates(TransformerFactoryImpl.java:824)
        at com.sun.org.apache.xalan.internal.xsltc.trax.TransformerFactoryImpl.newTransformer(TransformerFactoryImpl.java:619)
        at org.apache.camel.maven.GenerateDocBookMojo.process(GenerateDocBookMojo.java:221)
        at org.apache.camel.maven.GenerateDocBookMojo.execute(GenerateDocBookMojo.java:160)
        at org.apache.maven.plugin.DefaultPluginManager.executeMojo(DefaultPluginManager.java:420)
        at org.apache.maven.lifecycle.DefaultLifecycleExecutor.executeGoals(DefaultLifecycleExecutor.java:539)
        at org.apache.maven.lifecycle.DefaultLifecycleExecutor.executeGoalWithLifecycle(DefaultLifecycleExecutor.java:480)
        at org.apache.maven.lifecycle.DefaultLifecycleExecutor.executeGoal(DefaultLifecycleExecutor.java:459)
        at org.apache.maven.lifecycle.DefaultLifecycleExecutor.executeGoalAndHandleFailures(DefaultLifecycleExecutor.java:311)
        at org.apache.maven.lifecycle.DefaultLifecycleExecutor.executeTaskSegments(DefaultLifecycleExecutor.java:278)
        at org.apache.maven.lifecycle.DefaultLifecycleExecutor.execute(DefaultLifecycleExecutor.java:143)
        at org.apache.maven.DefaultMaven.doExecute(DefaultMaven.java:330)
        at org.apache.maven.DefaultMaven.execute(DefaultMaven.java:123)
        at org.apache.maven.cli.MavenCli.main(MavenCli.java:272)
        at sun.reflect.NativeMethodAccessorImpl.invoke0(Native Method)
        at sun.reflect.NativeMethodAccessorImpl.invoke(NativeMethodAccessorImpl.java:39)
        at sun.reflect.DelegatingMethodAccessorImpl.invoke(DelegatingMethodAccessorImpl.java:25)
        at java.lang.reflect.Method.invoke(Method.java:585)
        at org.codehaus.classworlds.Launcher.launchEnhanced(Launcher.java:315)
        at org.codehaus.classworlds.Launcher.launch(Launcher.java:255)
        at org.codehaus.classworlds.Launcher.mainWithExitCode(Launcher.java:430)
        at org.codehaus.classworlds.Launcher.main(Launcher.java:375)
[INFO] [docbkx:generate-html {execution: execution1}]
[INFO] Processing manual.xml
[INFO] [docbkx:generate-pdf {execution: execution2}]
[INFO] Processing manual.xml
[INFO] Using com.icl.saxon.aelfred.SAXDriver as SAX2 Parser
[INFO] building formatting object tree
[INFO] setting up fonts
[INFO] [1]
[INFO] [2]
[INFO] Parsing of document complete, stopping renderer
[INFO] ------------------------------------------------------------------------
[ERROR] BUILD ERROR
[INFO] ------------------------------------------------------------------------
[INFO] Failed to convert to PDF

Embedded error: file:/workspace/java/camel/tooling/camel-book/:11:2965 fo:flow must contain block-level children

--
This message is automatically generated by JIRA.
-
You can reply to this email to add a comment to the issue online.

Reply | Threaded
Open this post in threaded view
|

[jira] Resolved: (CAMEL-58) build seems broken

JIRA jira@apache.org

     [ https://issues.apache.org/activemq/browse/CAMEL-58?page=com.atlassian.jira.plugin.system.issuetabpanels:all-tabpanel ]

Jonas Lim resolved CAMEL-58.
----------------------------

    Resolution: Fixed

The docbook plugin will need to be build first   since an update was made there to move the xsl inside the plugin.  

Updated the tooling project to build first the docbook plugin before the project : r552637

> build seems broken
> ------------------
>
>                 Key: CAMEL-58
>                 URL: https://issues.apache.org/activemq/browse/CAMEL-58
>             Project: Apache Camel
>          Issue Type: Sub-task
>            Reporter: James Strachan
>            Assignee: Jonas Lim
>            Priority: Blocker
>
> ERROR:  'null'
> FATAL ERROR:  'Could not compile stylesheet'
> javax.xml.transform.TransformerConfigurationException: Could not compile stylesheet
>         at com.sun.org.apache.xalan.internal.xsltc.trax.TransformerFactoryImpl.newTemplates(TransformerFactoryImpl.java:824)
>         at com.sun.org.apache.xalan.internal.xsltc.trax.TransformerFactoryImpl.newTransformer(TransformerFactoryImpl.java:619)
>         at org.apache.camel.maven.GenerateDocBookMojo.process(GenerateDocBookMojo.java:221)
>         at org.apache.camel.maven.GenerateDocBookMojo.execute(GenerateDocBookMojo.java:160)
>         at org.apache.maven.plugin.DefaultPluginManager.executeMojo(DefaultPluginManager.java:420)
>         at org.apache.maven.lifecycle.DefaultLifecycleExecutor.executeGoals(DefaultLifecycleExecutor.java:539)
>         at org.apache.maven.lifecycle.DefaultLifecycleExecutor.executeGoalWithLifecycle(DefaultLifecycleExecutor.java:480)
>         at org.apache.maven.lifecycle.DefaultLifecycleExecutor.executeGoal(DefaultLifecycleExecutor.java:459)
>         at org.apache.maven.lifecycle.DefaultLifecycleExecutor.executeGoalAndHandleFailures(DefaultLifecycleExecutor.java:311)
>         at org.apache.maven.lifecycle.DefaultLifecycleExecutor.executeTaskSegments(DefaultLifecycleExecutor.java:278)
>         at org.apache.maven.lifecycle.DefaultLifecycleExecutor.execute(DefaultLifecycleExecutor.java:143)
>         at org.apache.maven.DefaultMaven.doExecute(DefaultMaven.java:330)
>         at org.apache.maven.DefaultMaven.execute(DefaultMaven.java:123)
>         at org.apache.maven.cli.MavenCli.main(MavenCli.java:272)
>         at sun.reflect.NativeMethodAccessorImpl.invoke0(Native Method)
>         at sun.reflect.NativeMethodAccessorImpl.invoke(NativeMethodAccessorImpl.java:39)
>         at sun.reflect.DelegatingMethodAccessorImpl.invoke(DelegatingMethodAccessorImpl.java:25)
>         at java.lang.reflect.Method.invoke(Method.java:585)
>         at org.codehaus.classworlds.Launcher.launchEnhanced(Launcher.java:315)
>         at org.codehaus.classworlds.Launcher.launch(Launcher.java:255)
>         at org.codehaus.classworlds.Launcher.mainWithExitCode(Launcher.java:430)
>         at org.codehaus.classworlds.Launcher.main(Launcher.java:375)
> [INFO] [docbkx:generate-html {execution: execution1}]
> [INFO] Processing manual.xml
> [INFO] [docbkx:generate-pdf {execution: execution2}]
> [INFO] Processing manual.xml
> [INFO] Using com.icl.saxon.aelfred.SAXDriver as SAX2 Parser
> [INFO] building formatting object tree
> [INFO] setting up fonts
> [INFO] [1]
> [INFO] [2]
> [INFO] Parsing of document complete, stopping renderer
> [INFO] ------------------------------------------------------------------------
> [ERROR] BUILD ERROR
> [INFO] ------------------------------------------------------------------------
> [INFO] Failed to convert to PDF
> Embedded error: file:/workspace/java/camel/tooling/camel-book/:11:2965 fo:flow must contain block-level children

--
This message is automatically generated by JIRA.
-
You can reply to this email to add a comment to the issue online.