Bamboo-3
Bamboo-3
Unregistered User
Groups: Anyone
Posts in Camel
1234 ... 31
Show   Total: 612 items
Date Subject Count Location
[Bamboo] Camel - Default build 889 was SUCCESSFUL (with 596 tests) 0 replies Camel - Commits (activemq)
[Bamboo] Camel - Default build 888 has FAILED (4 tests failed). Change made by ningjiang 0 replies Camel - Commits (activemq)
[Bamboo] Camel - Default build 885 has FAILED (1 tests failed). Change made by ningjiang 0 replies Camel - Commits (activemq)
[Bamboo] Camel - NightlySite build 332 has FAILED. Change made by 4 authors 0 replies Camel - Commits (activemq)
[Bamboo] Camel - Default build 884 was SUCCESSFUL (with 590 tests). Change made by ningjiang 0 replies Camel - Commits (activemq)
[Bamboo] Camel - Default build 883 has FAILED (2 tests failed, 1 failures were new) 0 replies Camel - Commits (activemq)
[Bamboo] Camel - NightlyDeploy build 270 has FAILED. Change made by James Strachan, hadrian and ningjiang 0 replies Camel - Commits (activemq)
[Bamboo] Camel - Default build 882 has FAILED (2 tests failed, 1 failures were new). Change made by James Strachan 0 replies Camel - Commits (activemq)
[Bamboo] Camel - Default build 881 has FAILED (1 tests failed, no failures were new). Change made by James Strachan 0 replies Camel - Commits (activemq)
[Bamboo] Camel - Default build 880 has FAILED (1 tests failed, no failures were new). Change made by James Strachan 0 replies Camel - Commits (activemq)
[Bamboo] Camel - Default build 879 has FAILED (1 tests failed, no failures were new). Change made by hadrian and James Strachan 0 replies Camel - Commits (activemq)
[Bamboo] Camel - Default build 876 has FAILED (1 tests failed). Change made by James Strachan and ningjiang 0 replies Camel - Commits (activemq)
[Bamboo] Camel - Default build 874 has FAILED (1 tests failed, no failures were new). Change made by James Strachan 0 replies Camel - Commits (activemq)
[Bamboo] Camel - Default build 873 has FAILED (1 tests failed, no failures were new). Change made by James Strachan 0 replies Camel - Commits (activemq)
[Bamboo] Camel - Default build 872 has FAILED (1 tests failed). Change made by hadrian 0 replies Camel - Commits (activemq)
[Bamboo] Camel - Default build 867 was SUCCESSFUL (with 574 tests). Change made by James Strachan 0 replies Camel - Commits (activemq)
[Bamboo] Camel - Default build 866 has FAILED (1 tests failed, no failures were new). Change made by ningjiang 0 replies Camel - Commits (activemq)
[Bamboo] Camel - Default build 865 has FAILED (1 tests failed, no failures were new). Change made by ningjiang 0 replies Camel - Commits (activemq)
[Bamboo] Camel - Default build 864 has FAILED (2 tests failed, no failures were new). Change made by ningjiang 0 replies Camel - Commits (activemq)
[Bamboo] Camel - Default build 863 has FAILED (5 tests failed, 2 failures were new). Change made by James Strachan and ningjiang 0 replies Camel - Commits (activemq)
1234 ... 31